Reaction Details
TargetSteroid 17-alpha-hydroxylase/17,20 lyase
LigandBDBM50052668
Substrate/Competitorn/a
Meas. Tech.ChEMBL_50521 (CHEMBL661138)
IC50 3.3±n/a nM
Citation Chan, FCPotter, GABarrie, SEHaynes, BPRowlands, MGHoughton, JJarman, M 3- and 4-pyridylalkyl adamantanecarboxylates: inhibitors of human cytochrome P450(17 alpha) (17 alpha-hydroxylase/C17,20-lyase). Potential nonsteroidal agents for the treatment of prostatic cancer. J Med Chem39:3319-23 (1996) 
 
Steroid 17-alpha-hydroxylase/17,20 lyase
Name:Steroid 17-alpha-hydroxylase/17,20 lyase
Type:Enzyme
Mol. Mass.:57382.42
Organism:Homo sapiens (Human)
Description:E.coli expressing human CYP17
Residue:508
BDBM50052668
NameBDBM50052668
Synonyms:Adamantane-1-carboxylic acid (S)-1-pyridin-4-yl-ethyl ester | CHEMBL110524
TypeSmall organic molecule
Emp. Form.C18H23NO2
Mol. Mass.285.3807
SMILESC[C@H](OC(=O)C12CC3CC(CC(C3)C1)C2)c1ccncc1