Reaction Details
TargetLow-density lipoprotein receptor
LigandBDBM50052686
Substrate/Competitorn/a
Meas. Tech.ChEMBL_99545 (CHEMBL707778)
EC50 600±n/a nM
Citation Ashton, MJBrown, TJFenton, GHalley, FHarper, MFLockey, PMPorter, BRoach, AGStuttle, KAVicker, NWalsh, RJ New low-density lipoprotein receptor upregulators acting via a novel mechanism. J Med Chem39:3343-56 (1996) 
 
Low-density lipoprotein receptor
Name:Low-density lipoprotein receptor
Type:PROTEIN
Mol. Mass.:95343.42
Organism:Homo sapiens (Human)
Description:ChEMBL_99545
Residue:860
BDBM50052686
NameBDBM50052686
Synonyms:CHEMBL115992 | N-{3-[(Benzo[1,3]dioxol-5-ylmethyl)-amino]-4-methyl-phenyl}-3-cyclohexyl-propionamide
TypeSmall organic molecule
Emp. Form.C24H30N2O3
Mol. Mass.394.5066
SMILESCc1ccc(NC(=O)CCC2CCCCC2)cc1NCc1ccc2OCOc2c1