Reaction Details
TargetGlutamate receptor ionotropic, kainate 2
LigandBDBM50053058
Substrate/Competitorn/a
Meas. Tech.ChEMBL_90456 (CHEMBL699991)
Ki 18.3±n/a nM
Citation Cantrell, BEZimmerman, DMMonn, JAKamboj, RKHoo, KHTizzano, JPPullar, IAFarrell, LNBleakman, D Synthesis of a series of aryl kainic acid analogs and evaluation in cells stably expressing the kainate receptor humGluR6. J Med Chem39:3617-24 (1996) 
 
Glutamate receptor ionotropic, kainate 2
Name:Glutamate receptor ionotropic, kainate 2
Type:Enzyme Catalytic Domain
Mol. Mass.:102592.78
Organism:Homo sapiens (Human)
Description:Q13002
Residue:908
BDBM50053058
NameBDBM50053058
Synonyms:(4E,6E)-(R)-7-[4,5-Bis-(1-hydroxy-vinyl)-pyrrolidin-3-yl]-3-methyl-octa-1,4,6-trien-2-ol | CHEMBL420720
TypeSmall organic molecule
Emp. Form.C17H25NO3
Mol. Mass.291.3853
SMILESC[C@H](C=CC=C(C)C1CNC(C1C(C)=O)C(C)=O)C(C)=O