Reaction Details
TargetGlutamate receptor ionotropic, kainate 2
LigandBDBM50053064
Substrate/Competitorn/a
Meas. Tech.ChEMBL_90595 (CHEMBL701552)
Ki 2.8±n/a nM
Citation Cantrell, BEZimmerman, DMMonn, JAKamboj, RKHoo, KHTizzano, JPPullar, IAFarrell, LNBleakman, D Synthesis of a series of aryl kainic acid analogs and evaluation in cells stably expressing the kainate receptor humGluR6. J Med Chem39:3617-24 (1996) 
 
Glutamate receptor ionotropic, kainate 2
Name:Glutamate receptor ionotropic, kainate 2
Type:PROTEIN
Mol. Mass.:102478.61
Organism:Rattus norvegicus
Description:ChEMBL_936439
Residue:908
BDBM50053064
NameBDBM50053064
Synonyms:(2S,3S,4S)-4-[1-(4-Butoxy-phenyl)-vinyl]-3-carboxymethyl-pyrrolidine-2-carboxylic acid | CHEMBL122507
TypeSmall organic molecule
Emp. Form.C19H25NO5
Mol. Mass.347.4055
SMILESCCCCOc1ccc(cc1)C(=C)[C@H]1CN[C@@H]([C@H]1CC(O)=O)C(O)=O