Reaction Details
TargetGlutamate receptor ionotropic, kainate 2
LigandBDBM50053061
Substrate/Competitorn/a
Meas. Tech.ChEMBL_90456 (CHEMBL699991)
Ki 31.7±n/a nM
Citation Cantrell, BEZimmerman, DMMonn, JAKamboj, RKHoo, KHTizzano, JPPullar, IAFarrell, LNBleakman, D Synthesis of a series of aryl kainic acid analogs and evaluation in cells stably expressing the kainate receptor humGluR6. J Med Chem39:3617-24 (1996) 
 
Glutamate receptor ionotropic, kainate 2
Name:Glutamate receptor ionotropic, kainate 2
Type:Enzyme Catalytic Domain
Mol. Mass.:102592.78
Organism:Homo sapiens (Human)
Description:Q13002
Residue:908
BDBM50053061
NameBDBM50053061
Synonyms:(2S,3S,4S)-3-Carboxymethyl-4-[1-(4-chloro-phenyl)-vinyl]-pyrrolidine-2-carboxylic acid | CHEMBL431839
TypeSmall organic molecule
Emp. Form.C15H16ClNO4
Mol. Mass.309.745
SMILESOC(=O)C[C@H]1[C@H](CN[C@@H]1C(O)=O)C(=C)c1ccc(Cl)cc1