Reaction Details
TargetGlutamate receptor ionotropic, kainate 2
LigandBDBM50002369
Substrate/Competitorn/a
Meas. Tech.ChEMBL_90456 (CHEMBL699991)
Ki 53±n/a nM
Citation Cantrell, BEZimmerman, DMMonn, JAKamboj, RKHoo, KHTizzano, JPPullar, IAFarrell, LNBleakman, D Synthesis of a series of aryl kainic acid analogs and evaluation in cells stably expressing the kainate receptor humGluR6. J Med Chem39:3617-24 (1996) 
 
Glutamate receptor ionotropic, kainate 2
Name:Glutamate receptor ionotropic, kainate 2
Type:Enzyme Catalytic Domain
Mol. Mass.:102592.78
Organism:Homo sapiens (Human)
Description:Q13002
Residue:908
BDBM50002369
NameBDBM50002369
Synonyms:(2S-(2alpha,3beta,4beta))-2-carboxy-4-(1-methylethenyl)-3-pyrrolidineacetic acid CHEMBL275040 Digensaeure Kainate L-alpha-kainic acid digenic acid | kainic acid
TypeSmall organic molecule
Emp. Form.C10H15NO4
Mol. Mass.213.2304
SMILESCC(=C)[C@H]1CN[C@@H]([C@H]1CC(O)=O)C(O)=O