Reaction Details
TargetGlutamate receptor ionotropic, kainate 2
LigandBDBM50053075
Substrate/Competitorn/a
Meas. Tech.ChEMBL_90456 (CHEMBL699991)
Ki 90.6±n/a nM
Citation Cantrell, BEZimmerman, DMMonn, JAKamboj, RKHoo, KHTizzano, JPPullar, IAFarrell, LNBleakman, D Synthesis of a series of aryl kainic acid analogs and evaluation in cells stably expressing the kainate receptor humGluR6. J Med Chem39:3617-24 (1996) 
 
Glutamate receptor ionotropic, kainate 2
Name:Glutamate receptor ionotropic, kainate 2
Type:Enzyme Catalytic Domain
Mol. Mass.:102592.78
Organism:Homo sapiens (Human)
Description:Q13002
Residue:908
BDBM50053075
NameBDBM50053075
Synonyms:(2S,3S,4S)-4-(1-Biphenyl-3-yl-vinyl)-3-carboxymethyl-pyrrolidine-2-carboxylic acid | CHEMBL121113
TypeSmall organic molecule
Emp. Form.C21H21NO4
Mol. Mass.351.3957
SMILESOC(=O)C[C@H]1[C@H](CN[C@@H]1C(O)=O)C(=C)c1cccc(c1)-c1ccccc1