Reaction Details
TargetGlutamate receptor ionotropic, kainate 2
LigandBDBM50053065
Substrate/Competitorn/a
Meas. Tech.ChEMBL_90595 (CHEMBL701552)
Ki 6.2±n/a nM
Citation Cantrell, BEZimmerman, DMMonn, JAKamboj, RKHoo, KHTizzano, JPPullar, IAFarrell, LNBleakman, D Synthesis of a series of aryl kainic acid analogs and evaluation in cells stably expressing the kainate receptor humGluR6. J Med Chem39:3617-24 (1996) 
 
Glutamate receptor ionotropic, kainate 2
Name:Glutamate receptor ionotropic, kainate 2
Type:PROTEIN
Mol. Mass.:102478.61
Organism:Rattus norvegicus
Description:ChEMBL_936439
Residue:908
BDBM50053065
NameBDBM50053065
Synonyms:(2S,3S,4S)-3-Carboxymethyl-4-[1-(4-phenethyloxy-phenyl)-vinyl]-pyrrolidine-2-carboxylic acid | CHEMBL332114
TypeSmall organic molecule
Emp. Form.C23H25NO5
Mol. Mass.395.4483
SMILESOC(=O)C[C@H]1[C@H](CN[C@@H]1C(O)=O)C(=C)c1ccc(OCCc2ccccc2)cc1