Reaction Details
TargetPhospholipase A2
LigandBDBM50053102
Substrate/Competitorn/a
Meas. Tech.ChEMBL_156183 (CHEMBL760952)
IC50 6±n/a nM
Citation Hagishita, SYamada, MShirahase, KOkada, TMurakami, YIto, YMatsuura, TWada, MKato, TUeno, MChikazawa, YYamada, KOno, TTeshirogi, IOhtani, M Potent inhibitors of secretory phospholipase A2: synthesis and inhibitory activities of indolizine and indene derivatives. J Med Chem39:3636-58 (1996) 
 
Phospholipase A2
Name:Phospholipase A2
Type:Protein
Mol. Mass.:16364.13
Organism:Homo sapiens (Human)
Description:P04054
Residue:148
BDBM50053102
NameBDBM50053102
Synonyms:CHEMBL121245 | [1-Aminooxalyl-3-(3-chloro-benzyl)-2-ethyl-indolizin-8-yloxy]-acetic acid
TypeSmall organic molecule
Emp. Form.C21H19ClN2O5
Mol. Mass.414.839
SMILESCCc1c(Cc2cccc(Cl)c2)n2cccc(OCC(O)=O)c2c1C(=O)C(N)=O