Reaction Details
TargetProthrombin
LigandBDBM50054484
Substrate/Competitorn/a
Meas. Tech.ChEMBL_207953 (CHEMBL811069)
IC50 0.71±n/a nM
Citation Levy, OESemple, JELim, MLReiner, JRote, WEDempsey, ERichard, BMZhang, ETulinsky, ARipka, WCNutt, RF Potent and selective thrombin inhibitors incorporating the constrained arginine mimic l-3-piperidyl(N-guanidino)alanine at P1. J Med Chem39:4527-30 (1996) 
 
Prothrombin
Name:Prothrombin
Type:Protein
Mol. Mass.:70029.57
Organism:Homo sapiens (Human)
Description:P00734
Residue:622
BDBM50054484
NameBDBM50054484
Synonyms:CHEMBL344204 N-((S)-1-Formyl-4-guanidino-butyl)-2-((S)-2-oxo-3-phenylmethanesulfonylamino-azepan-1-yl)-acetamide
TypeSmall organic molecule
Emp. Form.C21H32N6O5S
Mol. Mass.480.581
SMILESNC(=N)NCCC[C@H](NC(=O)CN1CCCC[C@H](NS(=O)(=O)Cc2ccccc2)C1=O)C=O