Reaction Details
TargetFibroblast growth factor receptor 2
LigandBDBM50065454
Substrate/Competitorn/a
Meas. Tech.ChEMBL_1813494 (CHEMBL4313068)
IC50 0.400000±n/a nM
Citation Wang, YDai, YWu, XLi, FLiu, BLi, CLiu, QZhou, YWang, BZhu, MCui, RTan, XXiong, ZLiu, JTan, MXu, YGeng, MJiang, HLiu, HAi, JZheng, M Discovery and Development of a Series of Pyrazolo[3,4- J Med Chem62:7473-7488 (2019) 
 
Fibroblast growth factor receptor 2
Name:Fibroblast growth factor receptor 2
Type:Enzyme
Mol. Mass.:92015.45
Organism:Homo sapiens (Human)
Description:P21802
Residue:821
BDBM50065454
NameBDBM50065454
Synonyms:CHEBI:63453 | CHEMBL3348846
TypeSmall organic molecule
Emp. Form.C26H33N5O3
Mol. Mass.463.5719
SMILESCOc1cc(CCc2cc(NC(=O)c3ccc(cc3)N3C[C@H](C)N[C@H](C)C3)n[nH]2)cc(OC)c1