Reaction Details
TargetATPase family AAA domain-containing protein 2
LigandBDBM50504166
Substrate/Competitorn/a
Meas. Tech.ChEMBL_1813632 (CHEMBL4313206)
IC50 30±n/a nM
Citation Bamborough, PChung, CWDemont, EHBridges, AMCraggs, PDDixon, DPFrancis, PFurze, RCGrandi, PJones, EJKaramshi, BLocke, KLucas, SCCMichon, AMMitchell, DJPogány, PPrinjha, RKRau, CRoa, AMRoberts, ADSheppard, RJWatson, RJ A Qualified Success: Discovery of a New Series of ATAD2 Bromodomain Inhibitors with a Novel Binding Mode Using High-Throughput Screening and Hit Qualification. J Med Chem62:7506-7525 (2019) 
 
ATPase family AAA domain-containing protein 2
Name:ATPase family AAA domain-containing protein 2
Type:PROTEIN
Mol. Mass.:158546.30
Organism:Homo sapiens (Human)
Description:ChEMBL_1500426
Residue:1390
BDBM50504166
NameBDBM50504166
Synonyms:CHEMBL4529901
TypeSmall organic molecule
Emp. Form.C18H20N6O
Mol. Mass.336.391
SMILESCN1CCN(CC1)c1nc(C(=O)c2ccccc2)c2cnn(C)c2n1