Reaction Details
TargetGag-Pol polyprotein [489-587]
LigandBDBM155
Substrate/Competitorn/a
Meas. Tech.ChEMBL_157575 (CHEMBL763326)
Ki 0.024±n/a nM
Citation Jadhav, PKAla, PWoerner, FJChang, CHGarber, SSAnton, EDBacheler, LT Cyclic urea amides: HIV-1 protease inhibitors with low nanomolar potency against both wild type and protease inhibitor resistant mutants of HIV. J Med Chem40:181-91 (1997) 
 
Gag-Pol polyprotein [489-587]
Name:Gag-Pol polyprotein [489-587]
Type:Enzyme Subunit
Mol. Mass.:10781.16
Organism:Human immunodeficiency virus type 1
Description:P04585[489-587]
Residue:99
BDBM155
NameBDBM155
Synonyms:CHEMBL11266 SD146
Typen/a
Emp. Form.C49H44N8O5
Mol. Mass.824.9243
SMILESO[C@@H]1[C@@H](O)[C@@H](Cc2ccccc2)N(Cc2cccc(c2)C(=O)Nc2nc3ccccc3[nH]2)C(=O)N(Cc2cccc(c2)C(=O)Nc2nc3ccccc3[nH]2)[C@@H]1Cc1ccccc1