Reaction Details
TargetGag-Pol polyprotein [489-587]
LigandBDBM50055590
Substrate/Competitorn/a
Meas. Tech.ChEMBL_157575 (CHEMBL763326)
Ki 0.016±n/a nM
Citation Jadhav, PKAla, PWoerner, FJChang, CHGarber, SSAnton, EDBacheler, LT Cyclic urea amides: HIV-1 protease inhibitors with low nanomolar potency against both wild type and protease inhibitor resistant mutants of HIV. J Med Chem40:181-91 (1997) 
 
Gag-Pol polyprotein [489-587]
Name:Gag-Pol polyprotein [489-587]
Type:Enzyme Subunit
Mol. Mass.:10781.16
Organism:Human immunodeficiency virus type 1
Description:P04585[489-587]
Residue:99
BDBM50055590
NameBDBM50055590
Synonyms:3-((4R,5S,6S,7R)-4,7-Dibenzyl-3-cyclopropylmethyl-5,6-dihydroxy-2-oxo-[1,3]diazepan-1-ylmethyl)-N-(1H-imidazol-2-yl)-benzamide | CHEMBL412862
TypeSmall organic molecule
Emp. Form.C34H37N5O4
Mol. Mass.579.6887
SMILESO[C@@H]1[C@@H](O)[C@@H](Cc2ccccc2)N(Cc2cccc(c2)C(=O)Nc2ncc[nH]2)C(=O)N(CC2CC2)[C@@H]1Cc1ccccc1