Reaction Details
TargetSodium-dependent dopamine transporter
LigandBDBM50056569
Substrate/Competitorn/a
Meas. Tech.ChEMBL_61835 (CHEMBL673205)
IC50 0.70±n/a nM
Citation Matecka, DLewis, DRothman, RBDersch, CMWojnicki, FHGlowa, JRDeVries, ACPert, ARice, KC Heteroaromatic analogs of 1-[2-(diphenylmethoxy)ethyl]- and 1-[2-[bis(4-fluorophenyl)methoxy]ethyl]-4-(3-phenylpropyl)piperazines (GBR 12935 and GBR 12909) as high-affinity dopamine reuptake inhibitors. J Med Chem40:705-16 (1997) 
 
Sodium-dependent dopamine transporter
Name:Sodium-dependent dopamine transporter
Type:Multi-pass membrane protein
Mol. Mass.:68749.45
Organism:Rattus norvegicus (rat)
Description:P23977
Residue:619
BDBM50056569
NameBDBM50056569
Synonyms:2-((4-(2-(bis(4-fluorophenyl)methoxy)ethyl)piperazin-1-yl)methyl)-1H-indole CHEMBL160073
TypeSmall organic molecule
Emp. Form.C28H29F2N3O
Mol. Mass.461.5462
SMILESFc1ccc(cc1)C(OCCN1CCN(Cc2cc3ccccc3[nH]2)CC1)c1ccc(F)cc1