Reaction Details
TargetCholecystokinin receptor type A
LigandBDBM50007925
Substrate/Competitorn/a
Meas. Tech.ChEMBL_49714 (CHEMBL661791)
IC50 3.8±n/a nM
Citation Shiosaki, KLin, CWKopecka, HBianchi, BMiller, TStashko, MWitte, D Minor structural differences in Boc-CCK-4 derivatives dictate affinity and selectivity for CCK-A and CCK-B receptors. J Med Chem40:1169-72 (1997) 
 
Cholecystokinin receptor type A
Name:Cholecystokinin receptor type A
Type:n/a
Mol. Mass.:48229.77
Organism:Cavia porcellus
Description:n/a
Residue:430
BDBM50007925
NameBDBM50007925
Synonyms:(S)-3-[(S)-2-[(S)-2-tert-Butoxycarbonylamino-3-(1H-indol-3-yl)-propionylamino]-6-(3-o-tolyl-ureido)-hexanoylamino]-N-((S)-1-carbamoyl-2-phenyl-ethyl)-succinamic acid CHEMBL320868
TypeSmall organic molecule
Emp. Form.C43H54N8O9
Mol. Mass.826.9371
SMILESCc1ccccc1NC(=O)NCCCC[C@H](NC(=O)[C@H](Cc1c[nH]c2ccccc12)NC(=O)OC(C)(C)C)C(=O)N[C@@H](CC(O)=O)C(=O)N[C@@H](Cc1ccccc1)C(N)=O