Reaction Details
TargetCorticotropin-releasing factor receptor 2
LigandBDBM50058163
Substrate/Competitorn/a
Meas. Tech.ChEMBL_51282 (CHEMBL664984)
Ki>10000±n/a nM
Citation Chen, YLMansbach, RSWinter, SMBrooks, ECollins, JCorman, MLDunaiskis, ARFaraci, WSGallaschun, RJSchmidt, ASchulz, DW Synthesis and oral efficacy of a 4-(butylethylamino)pyrrolo[2,3-d]pyrimidine: a centrally active corticotropin-releasing factor1 receptor antagonist. J Med Chem40:1749-54 (1997) 
 
Corticotropin-releasing factor receptor 2
Name:Corticotropin-releasing factor receptor 2
Type:Enzyme Catalytic Domain
Mol. Mass.:47697.09
Organism:RAT
Description:CRF2 Beta 0 RAT::P47866
Residue:411
BDBM50058163
NameBDBM50058163
Synonyms:Butyl-[2,5-dimethyl-7-(2,4,6-trimethyl-phenyl)-7H-pyrrolo[2,3-d]pyrimidin-4-yl]-ethyl-amine CP 154,526 N-butyl-N-ethyl-7-mesityl-2,5-dimethyl-7H-pyrrolo[2,3-d]pyrimidin-4-amine
TypeSmall organic molecule
Emp. Form.C23H32N4
Mol. Mass.364.527
SMILESCCCCN(CC)c1nc(C)nc2n(cc(C)c12)-c1c(C)cc(C)cc1C