Reaction Details
TargetMyosin light chain kinase, smooth muscle
LigandBDBM50058332
Substrate/Competitorn/a
Meas. Tech.ChEMBL_202414 (CHEMBL805569)
IC50>10±n/a nM
Citation Kaneko, MSaito, YSaito, HMatsumoto, TMatsuda, YVaught, JLDionne, CAAngeles, TSGlicksman, MANeff, NTRotella, DPKauer, JCMallamo, JPHudkins, RLMurakata, C Neurotrophic 3,9-bis[(alkylthio)methyl]-and-bis(alkoxymethyl)-K-252a derivatives. J Med Chem40:1863-9 (1997) 
 
Myosin light chain kinase, smooth muscle
Name:Myosin light chain kinase, smooth muscle
Type:Enzyme
Mol. Mass.:210423.57
Organism:Gallus gallus (chicken)
Description:n/a
Residue:1906
BDBM50058332
NameBDBM50058332
Synonyms:CHEMBL299496 | methyl 10,23-di(ethylsulfanylmethyl)-16-hydroxy-15-methyl-3-oxo-(15S,16R)-28-oxa-4,14,19-triazaoctacyclo[12.11.2.115,18.02,6.07,27.08,13.019,26.020,25]octacosa-1(26),2(6),7(27),8,10,12,20(25),21,23-nonaene-16-carboxylate
TypeSmall organic molecule
Emp. Form.C33H33N3O5S2
Mol. Mass.615.762
SMILESCCSCc1ccc2n3C4C[C@](O)(C(=O)OC)[C@](C)(O4)n4c5ccc(CSCC)cc5c5c6CNC(=O)c6c(c2c1)c3c45