Reaction Details
TargetProto-oncogene tyrosine-protein kinase Src
LigandBDBM3450
Substrate/Competitorn/a
Meas. Tech.ChEMBL_216986 (CHEMBL822802)
IC50 23±n/a nM
Citation Hamby, JMConnolly, CJSchroeder, MCWinters, RTShowalter, HDPanek, RLMajor, TCOlsewski, BRyan, MJDahring, TLu, GHKeiser, JAmar, AShen, CKraker, AJSlintak, VNelson, JMFry, DWBradford, LHallak, HDoherty, AM Structure-activity relationships for a novel series of pyrido[2,3-d]pyrimidine tyrosine kinase inhibitors. J Med Chem40:2296-303 (1997) 
 
Proto-oncogene tyrosine-protein kinase Src
Name:Proto-oncogene tyrosine-protein kinase Src
Type:Protein
Mol. Mass.:59838.60
Organism:Homo sapiens (Human)
Description:P12931
Residue:536
BDBM3450
NameBDBM3450
Synonyms:1-[6-(2,6-dichlorophenyl)-2-{[4-(diethylamino)butyl]amino}pyrido[2,3-d]pyrimidin-7-yl]-3-ethylurea CHEMBL301483
TypeSmall organic molecule
Emp. Form.C24H31Cl2N7O
Mol. Mass.504.455
SMILESCCNC(=O)Nc1nc2nc(NCCCCN(CC)CC)ncc2cc1-c1c(Cl)cccc1Cl