Reaction Details
TargetMyeloperoxidase
LigandBDBM50507392
Substrate/Competitorn/a
Meas. Tech.ChEMBL_1829870 (CHEMBL4329744)
IC50 4.6±n/a nM
Citation Wurtz, NRViet, AShaw, SADilger, AValente, MNKhan, JAJusuf, SNarayanan, RFernando, GLo, FLiu, XLocke, GAKopcho, LAbell, LMSleph, PBasso, MZhao, LWexler, RRDuclos, FKick, EK Potent Triazolopyridine Myeloperoxidase Inhibitors. ACS Med Chem Lett9:1175-1180 (2018) 
 
Myeloperoxidase
Name:Myeloperoxidase
Type:Enzyme
Mol. Mass.:83888.32
Organism:Homo sapiens (Human)
Description:P05164
Residue:745
BDBM50507392
NameBDBM50507392
Synonyms:CHEMBL4548537 | US10981879, Example 11
TypeSmall organic molecule
Emp. Form.C12H9Cl2N5S
Mol. Mass.326.204
SMILESNc1cc(SCc2c(Cl)cccc2Cl)c2nn[nH]c2n1