Reaction Details
TargetTyrosine-protein kinase BTK
LigandBDBM50097393
Substrate/Competitorn/a
Meas. Tech.ChEMBL_1835637 (CHEMBL4335770)
IC50 5.6±n/a nM
Citation Yao, XSun, XJin, SYang, LXu, HRao, Y Discovery of 4-Aminoquinoline-3-carboxamide Derivatives as Potent Reversible Bruton's Tyrosine Kinase Inhibitors for the Treatment of Rheumatoid Arthritis. J Med Chem62:6561-6574 (2019) 
 
Tyrosine-protein kinase BTK
Name:Tyrosine-protein kinase BTK
Type:Enzyme
Mol. Mass.:76289.95
Organism:Homo sapiens (Human)
Description:Q06187
Residue:659
BDBM50097393
NameBDBM50097393
Synonyms:CHEMBL3586447
TypeSmall organic molecule
Emp. Form.C17H14N6O
Mol. Mass.318.3327
SMILESCc1cc2cn[nH]c2cc1-c1cccc2c(N)c(nnc12)C(N)=O