Reaction Details
TargetNitric oxide synthase, inducible
LigandBDBM50062129
Substrate/Competitorn/a
Meas. Tech.ChEMBL_89200 (CHEMBL701151)
IC50 99000±n/a nM
Citation Webber, RKMetz, SMoore, WMConnor, JRCurrie, MGFok, KFHagen, TJHansen, DWJerome, GMManning, PTPitzele, BSToth, MVTrivedi, MZupec, METjoeng, FS Substituted 2-iminopiperidines as inhibitors of human nitric oxide synthase isoforms. J Med Chem41:96-101 (1998) 
 
Nitric oxide synthase, inducible
Name:Nitric oxide synthase, inducible
Type:Homodimer
Mol. Mass.:131141.95
Organism:Homo sapiens (Human)
Description:P35228
Residue:1153
BDBM50062129
NameBDBM50062129
Synonyms:3,4-Dihydro-1H-quinolin-(2E)-ylideneamine CHEMBL6656
TypeSmall organic molecule
Emp. Form.C9H10N2
Mol. Mass.146.1891
SMILESNC1=Nc2ccccc2CC1