Reaction Details
TargetAndrogen receptor
LigandBDBM50062405
Substrate/Competitorn/a
Meas. Tech.ChEMBL_36281 (CHEMBL651955)
Ki 795±n/a nM
Citation Zhi, LTegley, CMKallel, EAMarschke, KBMais, DEGottardis, MMJones, TK 5-Aryl-1,2-dihydrochromeno[3,4-f]quinolines: a novel class of nonsteroidal human progesterone receptor agonists. J Med Chem41:291-302 (1998) 
 
Androgen receptor
Name:Androgen receptor
Type:Receptor
Mol. Mass.:99185.27
Organism:Homo sapiens (Human)
Description:CHO cells were stably transfected with human AR gene.
Residue:920
BDBM50062405
NameBDBM50062405
Synonyms:2,2,4-Trimethyl-5-(3-trifluoromethyl-phenyl)-2,5-dihydro-1H-6-oxa-1-aza-chrysene | CHEMBL318513
TypeSmall organic molecule
Emp. Form.C26H22F3NO
Mol. Mass.421.4542
SMILESCC1=CC(C)(C)Nc2ccc3-c4ccccc4OC(c4cccc(c4)C(F)(F)F)c3c12