Reaction Details
TargetProgesterone receptor
LigandBDBM50062411
Substrate/Competitorn/a
Meas. Tech.ChEMBL_159557 (CHEMBL765845)
Ki 2.3±n/a nM
Citation Zhi, LTegley, CMKallel, EAMarschke, KBMais, DEGottardis, MMJones, TK 5-Aryl-1,2-dihydrochromeno[3,4-f]quinolines: a novel class of nonsteroidal human progesterone receptor agonists. J Med Chem41:291-302 (1998) 
 
Progesterone receptor
Name:Progesterone receptor
Type:Protein
Mol. Mass.:98979.52
Organism:Homo sapiens (Human)
Description:P06401
Residue:933
BDBM50062411
NameBDBM50062411
Synonyms:2,2,4-Trimethyl-5-p-tolyl-2,5-dihydro-1H-6-oxa-1-aza-chrysene | CHEMBL102403
TypeSmall organic molecule
Emp. Form.C26H25NO
Mol. Mass.367.4828
SMILESCC1=CC(C)(C)Nc2ccc3-c4ccccc4OC(c4ccc(C)cc4)c3c12