Reaction Details
TargetMatrix metalloproteinase-14
LigandBDBM50063910
Substrate/Competitorn/a
Meas. Tech.ChEMBL_217867 (CHEMBL822190)
IC50 1.9±n/a nM
Citation Yamamoto, MTsujishita, HHori, NOhishi, YInoue, SIkeda, SOkada, Y Inhibition of membrane-type 1 matrix metalloproteinase by hydroxamate inhibitors: an examination of the subsite pocket. J Med Chem41:1209-17 (1998) 
 
Matrix metalloproteinase-14
Name:Matrix metalloproteinase-14
Type:Protein
Mol. Mass.:65900.19
Organism:Homo sapiens (Human)
Description:P50281
Residue:582
BDBM50063910
NameBDBM50063910
Synonyms:(R)-N*1*-((S)-2,2-Dimethyl-1-methylcarbamoyl-propyl)-N*4*-hydroxy-2-(3-phenyl-propyl)-succinamide CHEMBL20154
TypeSmall organic molecule
Emp. Form.C20H31N3O4
Mol. Mass.377.4778
SMILESCNC(=O)[C@@H](NC(=O)[C@H](CCCc1ccccc1)CC(=O)NO)C(C)(C)C