Reaction Details
TargetMatrix metalloproteinase-9
LigandBDBM50063921
Substrate/Competitorn/a
Meas. Tech.ChEMBL_105225 (CHEMBL710584)
IC50 0.900000±n/a nM
Citation Yamamoto, MTsujishita, HHori, NOhishi, YInoue, SIkeda, SOkada, Y Inhibition of membrane-type 1 matrix metalloproteinase by hydroxamate inhibitors: an examination of the subsite pocket. J Med Chem41:1209-17 (1998) 
 
Matrix metalloproteinase-9
Name:Matrix metalloproteinase-9
Type:Enzyme
Mol. Mass.:78452.28
Organism:Homo sapiens (Human)
Description:P14780
Residue:707
BDBM50063921
NameBDBM50063921
Synonyms:(2R,3S)-N*1*-((S)-Cyclohexyl-methylcarbamoyl-methyl)-N*4*-hydroxy-2-isobutyl-3-methyl-succinamide | CHEMBL19932
TypeSmall organic molecule
Emp. Form.C18H33N3O4
Mol. Mass.355.4723
SMILESCNC(=O)[C@@H](NC(=O)[C@H](CC(C)C)[C@H](C)C(=O)NO)C1CCCCC1