Reaction Details
Target72 kDa type IV collagenase
LigandBDBM50063912
Substrate/Competitorn/a
Meas. Tech.ChEMBL_106804 (CHEMBL717492)
IC50 1.6±n/a nM
Citation Yamamoto, MTsujishita, HHori, NOhishi, YInoue, SIkeda, SOkada, Y Inhibition of membrane-type 1 matrix metalloproteinase by hydroxamate inhibitors: an examination of the subsite pocket. J Med Chem41:1209-17 (1998) 
 
72 kDa type IV collagenase
Name:72 kDa type IV collagenase
Type:Enzyme
Mol. Mass.:73870.36
Organism:Homo sapiens (Human)
Description: P08253
Residue:660
BDBM50063912
NameBDBM50063912
Synonyms:(R)-N*4*-Hydroxy-N*1*-((S)-methylcarbamoyl-phenyl-methyl)-2-nonyl-succinamide | CHEMBL433426
TypeSmall organic molecule
Emp. Form.C22H35N3O4
Mol. Mass.405.531
SMILESCCCCCCCCC[C@H](CC(=O)NO)C(=O)N[C@H](C(=O)NC)c1ccccc1