Reaction Details
TargetInterstitial collagenase
LigandBDBM50063921
Substrate/Competitorn/a
Meas. Tech.ChEMBL_105950 (CHEMBL715364)
IC50 2.9±n/a nM
Citation Yamamoto, MTsujishita, HHori, NOhishi, YInoue, SIkeda, SOkada, Y Inhibition of membrane-type 1 matrix metalloproteinase by hydroxamate inhibitors: an examination of the subsite pocket. J Med Chem41:1209-17 (1998) 
 
Interstitial collagenase
Name:Interstitial collagenase
Type:Enzyme
Mol. Mass.:54010.26
Organism:Homo sapiens (Human)
Description: P03956
Residue:469
BDBM50063921
NameBDBM50063921
Synonyms:(2R,3S)-N*1*-((S)-Cyclohexyl-methylcarbamoyl-methyl)-N*4*-hydroxy-2-isobutyl-3-methyl-succinamide | CHEMBL19932
TypeSmall organic molecule
Emp. Form.C18H33N3O4
Mol. Mass.355.4723
SMILESCNC(=O)[C@@H](NC(=O)[C@H](CC(C)C)[C@H](C)C(=O)NO)C1CCCCC1