Reaction Details
TargetInterstitial collagenase
LigandBDBM50063915
Substrate/Competitorn/a
Meas. Tech.ChEMBL_105950 (CHEMBL715364)
IC50 0.3±n/a nM
Citation Yamamoto, MTsujishita, HHori, NOhishi, YInoue, SIkeda, SOkada, Y Inhibition of membrane-type 1 matrix metalloproteinase by hydroxamate inhibitors: an examination of the subsite pocket. J Med Chem41:1209-17 (1998) 
 
Interstitial collagenase
Name:Interstitial collagenase
Type:Enzyme
Mol. Mass.:54010.26
Organism:Homo sapiens (Human)
Description: P03956
Residue:469
BDBM50063915
NameBDBM50063915
Synonyms:(2R,3S)-N*4*-Hydroxy-2-isobutyl-3-methyl-N*1*-[(S)-1-methylcarbamoyl-2-(5,6,7,8-tetrahydro-naphthalen-1-yl)-ethyl]-succinamide | CHEMBL279078
TypeSmall organic molecule
Emp. Form.C23H35N3O4
Mol. Mass.417.5417
SMILESCNC(=O)[C@H](Cc1cccc2CCCCc12)NC(=O)[C@H](CC(C)C)[C@H](C)C(=O)NO