Reaction Details
TargetStromelysin-1
LigandBDBM50063922
Substrate/Competitorn/a
Meas. Tech.ChEMBL_104576 (CHEMBL714859)
IC50 1.9±n/a nM
Citation Yamamoto, MTsujishita, HHori, NOhishi, YInoue, SIkeda, SOkada, Y Inhibition of membrane-type 1 matrix metalloproteinase by hydroxamate inhibitors: an examination of the subsite pocket. J Med Chem41:1209-17 (1998) 
 
Stromelysin-1
Name:Stromelysin-1
Type:Enzyme
Mol. Mass.:53973.13
Organism:Homo sapiens (Human)
Description: P08254
Residue:477
BDBM50063922
NameBDBM50063922
Synonyms:(2R,3S)-N*4*-Hydroxy-2-isobutyl-3-methyl-N*1*-((S)-methylcarbamoyl-phenyl-methyl)-succinamide | CHEMBL19843
TypeSmall organic molecule
Emp. Form.C18H27N3O4
Mol. Mass.349.4247
SMILESCNC(=O)[C@@H](NC(=O)[C@H](CC(C)C)[C@H](C)C(=O)NO)c1ccccc1