Reaction Details
TargetVascular endothelial growth factor receptor 2
LigandBDBM4810
Substrate/Competitorn/a
Meas. Tech.ChEMBL_1839864 (CHEMBL4340079)
IC50 12900±n/a nM
Citation Salerno, SBarresi, EGarcía-Argáez, ANTaliani, SSimorini, FAmendola, GTomassi, SCosconati, SNovellino, EDa Settimo, FMarini, AMDalla Via, L Discovery of Pyrido[3',2':5,6]thiopyrano[4,3- ACS Med Chem Lett10:457-462 (2019) 
 
Vascular endothelial growth factor receptor 2
Name:Vascular endothelial growth factor receptor 2
Type:Receptor Tyrosine Kinase
Mol. Mass.:151510.97
Organism:Homo sapiens (Human)
Description:P35968
Residue:1356
BDBM4810
NameBDBM4810
Synonyms:(3Z)-3-[(3,5-dimethyl-1H-pyrrol-2-yl)methylidene]-2,3-dihydro-1H-indol-2-one CHEMBL276711 SU5416 US10189853, semaxanib US9422297, SU5416 | cid_5329098
TypeSmall organic molecule
Emp. Form.C15H14N2O
Mol. Mass.238.2845
SMILESCc1cc(C)c(\C=C2/C(=O)Nc3ccccc23)[nH]1