Reaction Details
TargetPlatelet-activating factor receptor
LigandBDBM50002823
Substrate/Competitorn/a
Meas. Tech.ChEMBL_158343 (CHEMBL768487)
IC50 6±n/a nM
Citation Cai, XScannell, RTYaeger, DHussoin, MSKillian, DBQian, CEckman, JHwang, SBLibertine-Garahan, LYeh, CGIp, SHShen, TY (+/-)-trans-2-[3-methoxy-4-(4-chlorophenylthioethoxy)-5-(N-methyl-N- hydroxyureidyl)methylphenyl]-5-(3,4, 5-trimethoxyphenyl)tetrahydrofuran (CMI-392), a potent dual 5-lipoxygenase inhibitor and platelet-activating factor receptor antagonist. J Med Chem41:1970-9 (1998) 
 
Platelet-activating factor receptor
Name:Platelet-activating factor receptor
Type:Enzyme Catalytic Domain
Mol. Mass.:39219.60
Organism:Homo sapiens (Human)
Description:PAF Platelet activating factor PTAFR HUMAN::P25105
Residue:342
BDBM50002823
NameBDBM50002823
Synonyms:2-{3-Methoxy-2-propoxy-5-[(2S,5S)-5-(3,4,5-trimethoxy-phenyl)-tetrahydro-furan-2-yl]-benzenesulfonyl}-ethanol L-680573 | MK-287
TypeSmall organic molecule
Emp. Form.C25H34O9S
Mol. Mass.510.597
SMILESCCCOc1c(OC)cc(cc1S(=O)(=O)CCO)[C@@H]1CC[C@H](O1)c1cc(OC)c(OC)c(OC)c1