Reaction Details
Target5-hydroxytryptamine receptor 1A
LigandBDBM50005835
Substrate/Competitorn/a
Meas. Tech.ChEMBL_959 (CHEMBL872105)
Ki 341.0±n/a nM
Citation Ennis, MDGhazal, NBHoffman, RLSmith, MWSchlachter, SKLawson, CFIm, WBPregenzer, JFSvensson, KALewis, RAHall, EDSutter, DMHarris, LTMcCall, RB Isochroman-6-carboxamides as highly selective 5-HT1D agonists: potential new treatment for migraine without cardiovascular side effects. J Med Chem41:2180-3 (1998) 
 
5-hydroxytryptamine receptor 1A
Name:5-hydroxytryptamine receptor 1A
Type:n/a
Mol. Mass.:46122.49
Organism:Homo sapiens (Human)
Description:n/a
Residue:422
BDBM50005835
NameBDBM50005835
Synonyms:(3-[2-(dimethylamino)ethyl]-1H-indol-5-yl)-N-methylmethanesulfonamide 1-{3-[2-(dimethylamino)ethyl]-1H-indol-5-yl}-N-methylmethanesulfonamide 3-[2-(dimethylamino)ethyl]-N-methylindole-5-methanesulfonamide SUMATRIPTAN Sumax
TypeSmall organic molecule
Emp. Form.C14H21N3O2S
Mol. Mass.295.4
SMILESCNS(=O)(=O)Cc1ccc2[nH]cc(CCN(C)C)c2c1