Reaction Details
Target5-hydroxytryptamine receptor 2A
LigandBDBM50064786
Substrate/Competitorn/a
Meas. Tech.ChEMBL_2499 (CHEMBL617386)
Ki 168±n/a nM
Citation Ennis, MDGhazal, NBHoffman, RLSmith, MWSchlachter, SKLawson, CFIm, WBPregenzer, JFSvensson, KALewis, RAHall, EDSutter, DMHarris, LTMcCall, RB Isochroman-6-carboxamides as highly selective 5-HT1D agonists: potential new treatment for migraine without cardiovascular side effects. J Med Chem41:2180-3 (1998) 
 
5-hydroxytryptamine receptor 2A
Name:5-hydroxytryptamine receptor 2A
Type:undefined
Mol. Mass.:52607.65
Organism:Homo sapiens (Human)
Description:P28223
Residue:471
BDBM50064786
NameBDBM50064786
Synonyms:(S)-1-(2-(4-(4-methoxyphenyl)piperazin-1-yl)ethyl)-N-methyl-3,4-dihydro-1H-isochromene-6-carboxamide CHEMBL71838
TypeSmall organic molecule
Emp. Form.C24H31N3O3
Mol. Mass.409.5212
SMILESCNC(=O)c1ccc2[C@H](CCN3CCN(CC3)c3ccc(OC)cc3)OCCc2c1