Reaction Details
TargetD(2) dopamine receptor
LigandBDBM50064786
Substrate/Competitorn/a
Meas. Tech.ChEMBL_60372 (CHEMBL672208)
Ki 241±n/a nM
Citation Ennis, MDGhazal, NBHoffman, RLSmith, MWSchlachter, SKLawson, CFIm, WBPregenzer, JFSvensson, KALewis, RAHall, EDSutter, DMHarris, LTMcCall, RB Isochroman-6-carboxamides as highly selective 5-HT1D agonists: potential new treatment for migraine without cardiovascular side effects. J Med Chem41:2180-3 (1998) 
 
D(2) dopamine receptor
Name:D(2) dopamine receptor
Type:Cell-surface receptors
Mol. Mass.:50647.10
Organism:Homo sapiens (Human)
Description:P14416
Residue:443
BDBM50064786
NameBDBM50064786
Synonyms:(S)-1-(2-(4-(4-methoxyphenyl)piperazin-1-yl)ethyl)-N-methyl-3,4-dihydro-1H-isochromene-6-carboxamide CHEMBL71838
TypeSmall organic molecule
Emp. Form.C24H31N3O3
Mol. Mass.409.5212
SMILESCNC(=O)c1ccc2[C@H](CCN3CCN(CC3)c3ccc(OC)cc3)OCCc2c1