Reaction Details
Target5-hydroxytryptamine receptor 2A
LigandBDBM50051562
Substrate/Competitorn/a
Meas. Tech.ChEMBL_2499 (CHEMBL617386)
Ki 76±n/a nM
Citation Ennis, MDGhazal, NBHoffman, RLSmith, MWSchlachter, SKLawson, CFIm, WBPregenzer, JFSvensson, KALewis, RAHall, EDSutter, DMHarris, LTMcCall, RB Isochroman-6-carboxamides as highly selective 5-HT1D agonists: potential new treatment for migraine without cardiovascular side effects. J Med Chem41:2180-3 (1998) 
 
5-hydroxytryptamine receptor 2A
Name:5-hydroxytryptamine receptor 2A
Type:undefined
Mol. Mass.:52607.65
Organism:Homo sapiens (Human)
Description:P28223
Residue:471
BDBM50051562
NameBDBM50051562
Synonyms:1-(2-Isochroman-1-yl-ethyl)-4-(4-methoxy-phenyl)-piperazine | CHEMBL71724
TypeSmall organic molecule
Emp. Form.C22H28N2O2
Mol. Mass.352.4699
SMILESCOc1ccc(cc1)N1CCN(CCC2OCCc3ccccc23)CC1