Reaction Details
Target5-hydroxytryptamine receptor 1D
LigandBDBM50064787
Substrate/Competitorn/a
Meas. Tech.ChEMBL_1650 (CHEMBL616742)
Ki 298±n/a nM
Citation Ennis, MDGhazal, NBHoffman, RLSmith, MWSchlachter, SKLawson, CFIm, WBPregenzer, JFSvensson, KALewis, RAHall, EDSutter, DMHarris, LTMcCall, RB Isochroman-6-carboxamides as highly selective 5-HT1D agonists: potential new treatment for migraine without cardiovascular side effects. J Med Chem41:2180-3 (1998) 
 
5-hydroxytryptamine receptor 1D
Name:5-hydroxytryptamine receptor 1D
Type:G Protein-Coupled Receptor (GPCR)
Mol. Mass.:41920.63
Organism:Homo sapiens (Human)
Description:Receptor binding assays were performed using human clone stably expressed in CHO cells.
Residue:377
BDBM50064787
NameBDBM50064787
Synonyms:(R)-1-{2-[4-(4-Methoxy-phenyl)-piperazin-1-yl]-ethyl}-isochroman-6-carboxylic acid methylamide | CHEMBL71798
TypeSmall organic molecule
Emp. Form.C24H31N3O3
Mol. Mass.409.5212
SMILESCNC(=O)c1ccc2[C@@H](CCN3CCN(CC3)c3ccc(OC)cc3)OCCc2c1