Reaction Details
Target5-hydroxytryptamine receptor 2A
LigandBDBM50064785
Substrate/Competitorn/a
Meas. Tech.ChEMBL_2499 (CHEMBL617386)
Ki 140±n/a nM
Citation Ennis, MDGhazal, NBHoffman, RLSmith, MWSchlachter, SKLawson, CFIm, WBPregenzer, JFSvensson, KALewis, RAHall, EDSutter, DMHarris, LTMcCall, RB Isochroman-6-carboxamides as highly selective 5-HT1D agonists: potential new treatment for migraine without cardiovascular side effects. J Med Chem41:2180-3 (1998) 
 
5-hydroxytryptamine receptor 2A
Name:5-hydroxytryptamine receptor 2A
Type:undefined
Mol. Mass.:52607.65
Organism:Homo sapiens (Human)
Description:P28223
Residue:471
BDBM50064785
NameBDBM50064785
Synonyms:1-{2-[4-(4-Methoxy-phenyl)-piperazin-1-yl]-ethyl}-isochroman-6-carboxylic acid amide | CHEMBL69385
TypeSmall organic molecule
Emp. Form.C23H29N3O3
Mol. Mass.395.4947
SMILESCOc1ccc(cc1)N1CCN(CCC2OCCc3cc(ccc23)C(N)=O)CC1