Reaction Details
TargetEpithelial discoidin domain-containing receptor 1
LigandBDBM88120
Substrate/Competitorn/a
Meas. Tech.ChEMBL_1842512 (CHEMBL4342939)
Kd 1.8±n/a nM
Citation Ramurthy, STaft, BRAversa, RJBarsanti, PABurger, MTLou, YNishiguchi, GARico, ASetti, LSmith, ASubramanian, STamez, VTanner, HWan, LHu, CAppleton, BAMamo, MTandeske, LTellew, JEHuang, SYue, QChaudhary, ATian, HIyer, RHassan, AQMathews Griner, LALa Bonte, LRCooke, VGVan Abbema, AMerritt, HGampa, KFeng, FYuan, JMishina, YWang, YHaling, JRVaziri, SHekmat-Nejad, MPolyakov, VZang, RSethuraman, VAmiri, PSingh, MSellers, WRLees, EShao, WDillon, MPStuart, DD Design and Discovery of  J Med Chem63:2013-2027 (2020) 
 
Epithelial discoidin domain-containing receptor 1
Name:Epithelial discoidin domain-containing receptor 1
Type:Tyrosine-protein kinase
Mol. Mass.:101130.02
Organism:Homo sapiens (Human)
Description:Q08345
Residue:913
BDBM88120
NameBDBM88120
Synonyms:US10245267, Example 1156 US9694016, 1156
TypeSmall organic molecule
Emp. Form.C25H25F3N4O4
Mol. Mass.502.4856
SMILESCc1ccc(NC(=O)c2ccnc(c2)C(F)(F)F)cc1-c1cc(OCCO)nc(c1)N1CCOCC1