Reaction Details
TargetRAF proto-oncogene serine/threonine-protein kinase
LigandBDBM88120
Substrate/Competitorn/a
Meas. Tech.ChEMBL_1842511 (CHEMBL4342938)
Kd 3.6±n/a nM
Citation Ramurthy, STaft, BRAversa, RJBarsanti, PABurger, MTLou, YNishiguchi, GARico, ASetti, LSmith, ASubramanian, STamez, VTanner, HWan, LHu, CAppleton, BAMamo, MTandeske, LTellew, JEHuang, SYue, QChaudhary, ATian, HIyer, RHassan, AQMathews Griner, LALa Bonte, LRCooke, VGVan Abbema, AMerritt, HGampa, KFeng, FYuan, JMishina, YWang, YHaling, JRVaziri, SHekmat-Nejad, MPolyakov, VZang, RSethuraman, VAmiri, PSingh, MSellers, WRLees, EShao, WDillon, MPStuart, DD Design and Discovery of  J Med Chem63:2013-2027 (2020) 
 
RAF proto-oncogene serine/threonine-protein kinase
Name:RAF proto-oncogene serine/threonine-protein kinase
Type:Serine/threonine-protein kinase
Mol. Mass.:73082.52
Organism:Homo sapiens (Human)
Description:P04049
Residue:648
BDBM88120
NameBDBM88120
Synonyms:US10245267, Example 1156 US9694016, 1156
TypeSmall organic molecule
Emp. Form.C25H25F3N4O4
Mol. Mass.502.4856
SMILESCc1ccc(NC(=O)c2ccnc(c2)C(F)(F)F)cc1-c1cc(OCCO)nc(c1)N1CCOCC1