Reaction Details
TargetSerine/threonine-protein kinase B-raf
LigandBDBM88120
Substrate/Competitorn/a
Meas. Tech.ChEMBL_1842510 (CHEMBL4342937)
Kd 1.3±n/a nM
Citation Ramurthy, STaft, BRAversa, RJBarsanti, PABurger, MTLou, YNishiguchi, GARico, ASetti, LSmith, ASubramanian, STamez, VTanner, HWan, LHu, CAppleton, BAMamo, MTandeske, LTellew, JEHuang, SYue, QChaudhary, ATian, HIyer, RHassan, AQMathews Griner, LALa Bonte, LRCooke, VGVan Abbema, AMerritt, HGampa, KFeng, FYuan, JMishina, YWang, YHaling, JRVaziri, SHekmat-Nejad, MPolyakov, VZang, RSethuraman, VAmiri, PSingh, MSellers, WRLees, EShao, WDillon, MPStuart, DD Design and Discovery of  J Med Chem63:2013-2027 (2020) 
 
Serine/threonine-protein kinase B-raf
Name:Serine/threonine-protein kinase B-raf
Type:Serine/threonine-protein kinase
Mol. Mass.:84446.00
Organism:Homo sapiens (Human)
Description:P15056
Residue:766
BDBM88120
NameBDBM88120
Synonyms:US10245267, Example 1156 US9694016, 1156
TypeSmall organic molecule
Emp. Form.C25H25F3N4O4
Mol. Mass.502.4856
SMILESCc1ccc(NC(=O)c2ccnc(c2)C(F)(F)F)cc1-c1cc(OCCO)nc(c1)N1CCOCC1