Reaction Details
TargetNeuropeptide Y receptor type 1
LigandBDBM50065461
Substrate/Competitorn/a
Meas. Tech.ChEMBL_143830 (CHEMBL748714)
Ki 30±n/a nM
Citation Zarrinmayeh, HNunes, AMOrnstein, PLZimmerman, DMArnold, MBSchober, DAGackenheimer, SLBruns, RFHipskind, PABritton, TCCantrell, BEGehlert, DR Synthesis and evaluation of a series of novel 2-[(4-chlorophenoxy)methyl]benzimidazoles as selective neuropeptide Y Y1 receptor antagonists. J Med Chem41:2709-19 (1998) 
 
Neuropeptide Y receptor type 1
Name:Neuropeptide Y receptor type 1
Type:Enzyme Catalytic Domain
Mol. Mass.:44399.07
Organism:Homo sapiens (Human)
Description:NPY-Y1 NPY1R HUMAN::P25929
Residue:384
BDBM50065461
NameBDBM50065461
Synonyms:2-(4-Chloro-phenoxymethyl)-4-(3-piperidin-3-yl-propoxy)-1-(3-piperidin-3-yl-propyl)-1H-benzoimidazole | CHEMBL328541
TypeSmall organic molecule
Emp. Form.C30H41ClN4O2
Mol. Mass.525.125
SMILESClc1ccc(OCc2nc3c(OCCCC4CCCNC4)cccc3n2CCCC2CCCNC2)cc1