Reaction Details
TargetD(2) dopamine receptor
LigandBDBM50065562
Substrate/Competitorn/a
Meas. Tech.ChEMBL_60973 (CHEMBL671591)
Ki 0.149±n/a nM
Citation Yasunaga, TKimura, TNaito, RKontani, TWanibuchi, FYamashita, HNomura, TTsukamoto, SYamaguchi, TMase, T Synthesis and pharmacological characterization of novel 6-fluorochroman derivatives as potential 5-HT1A receptor antagonists. J Med Chem41:2765-78 (1998) 
 
D(2) dopamine receptor
Name:D(2) dopamine receptor
Type:G Protein-Coupled Receptor (GPCR)
Mol. Mass.:50931.60
Organism:Rattus norvegicus (rat)
Description:P61169
Residue:444
BDBM50065562
NameBDBM50065562
Synonyms:CHEMBL96279 | [2-(6-Fluoro-2,2-dimethyl-chroman-8-yloxy)-ethyl]-[4-(4-methoxy-phenyl)-butyl]-amine
TypeSmall organic molecule
Emp. Form.C24H32FNO3
Mol. Mass.401.5142
SMILESCOc1ccc(CCCCNCCOc2cc(F)cc3CCC(C)(C)Oc23)cc1