Reaction Details
Target5-hydroxytryptamine receptor 1A
LigandBDBM50065555
Substrate/Competitorn/a
Meas. Tech.ChEMBL_1127 (CHEMBL616072)
Ki 0.188±n/a nM
Citation Yasunaga, TKimura, TNaito, RKontani, TWanibuchi, FYamashita, HNomura, TTsukamoto, SYamaguchi, TMase, T Synthesis and pharmacological characterization of novel 6-fluorochroman derivatives as potential 5-HT1A receptor antagonists. J Med Chem41:2765-78 (1998) 
 
5-hydroxytryptamine receptor 1A
Name:5-hydroxytryptamine receptor 1A
Type:G Protein-Coupled Receptor (GPCR)
Mol. Mass.:46445.29
Organism:Rattus norvegicus (rat)
Description:Binding assays were performed using rat hippocampal membranes.
Residue:422
BDBM50065555
NameBDBM50065555
Synonyms:CHEMBL96578 | [2-(6-Fluoro-2-methyl-chroman-8-yloxy)-ethyl]-[2-(4-methoxy-phenyl)-ethyl]-amine
TypeSmall organic molecule
Emp. Form.C21H26FNO3
Mol. Mass.359.4344
SMILESCOc1ccc(CCNCCOc2cc(F)cc3CCC(C)Oc23)cc1