Reaction Details
Target5-hydroxytryptamine receptor 1A
LigandBDBM50065578
Substrate/Competitorn/a
Meas. Tech.ChEMBL_1127 (CHEMBL616072)
Ki 0.159±n/a nM
Citation Yasunaga, TKimura, TNaito, RKontani, TWanibuchi, FYamashita, HNomura, TTsukamoto, SYamaguchi, TMase, T Synthesis and pharmacological characterization of novel 6-fluorochroman derivatives as potential 5-HT1A receptor antagonists. J Med Chem41:2765-78 (1998) 
 
5-hydroxytryptamine receptor 1A
Name:5-hydroxytryptamine receptor 1A
Type:G Protein-Coupled Receptor (GPCR)
Mol. Mass.:46445.29
Organism:Rattus norvegicus (rat)
Description:Binding assays were performed using rat hippocampal membranes.
Residue:422
BDBM50065578
NameBDBM50065578
Synonyms:CHEMBL419147 | [2-(6-Fluoro-2H-chromen-8-yloxy)-ethyl]-[4-(4-methoxy-phenyl)-butyl]-amine
TypeSmall organic molecule
Emp. Form.C22H26FNO3
Mol. Mass.371.4451
SMILESCOc1ccc(CCCCNCCOc2cc(F)cc3C=CCOc23)cc1