Reaction Details
Target5-hydroxytryptamine receptor 1A
LigandBDBM50057436
Substrate/Competitorn/a
Meas. Tech.ChEMBL_1127 (CHEMBL616072)
Ki 0.221±n/a nM
Citation Yasunaga, TKimura, TNaito, RKontani, TWanibuchi, FYamashita, HNomura, TTsukamoto, SYamaguchi, TMase, T Synthesis and pharmacological characterization of novel 6-fluorochroman derivatives as potential 5-HT1A receptor antagonists. J Med Chem41:2765-78 (1998) 
 
5-hydroxytryptamine receptor 1A
Name:5-hydroxytryptamine receptor 1A
Type:G Protein-Coupled Receptor (GPCR)
Mol. Mass.:46445.29
Organism:Rattus norvegicus (rat)
Description:Binding assays were performed using rat hippocampal membranes.
Residue:422
BDBM50057436
NameBDBM50057436
Synonyms:CHEMBL25213 | [2-(6-Fluoro-chroman-8-yloxy)-ethyl]-[4-(4-methoxy-phenyl)-butyl]-amine
TypeSmall organic molecule
Emp. Form.C22H28FNO3
Mol. Mass.373.461
SMILESCOc1ccc(CCCCNCCOc2cc(F)cc3CCCOc23)cc1