Reaction Details
TargetD(2) dopamine receptor
LigandBDBM50065565
Substrate/Competitorn/a
Meas. Tech.ChEMBL_60973 (CHEMBL671591)
Ki 4.98±n/a nM
Citation Yasunaga, TKimura, TNaito, RKontani, TWanibuchi, FYamashita, HNomura, TTsukamoto, SYamaguchi, TMase, T Synthesis and pharmacological characterization of novel 6-fluorochroman derivatives as potential 5-HT1A receptor antagonists. J Med Chem41:2765-78 (1998) 
 
D(2) dopamine receptor
Name:D(2) dopamine receptor
Type:G Protein-Coupled Receptor (GPCR)
Mol. Mass.:50931.60
Organism:Rattus norvegicus (rat)
Description:P61169
Residue:444
BDBM50065565
NameBDBM50065565
Synonyms:CHEMBL92651 | [2-(6-Fluoro-2-methyl-chroman-8-yloxy)-ethyl]-[3-(4-methoxy-phenyl)-propyl]-amine
TypeSmall organic molecule
Emp. Form.C22H28FNO3
Mol. Mass.373.461
SMILESCOc1ccc(CCCNCCOc2cc(F)cc3CCC(C)Oc23)cc1