Reaction Details
TargetGenome polyprotein
LigandBDBM50065886
Substrate/Competitorn/a
Meas. Tech.ChEMBL_158967 (CHEMBL766325)
IC50 3900±n/a nM
Citation Yoakim, COgilvie, WWCameron, DRChabot, CGuse, IHaché, BNaud, JO'Meara, JAPlante, RDéziel, R beta-Lactam derivatives as inhibitors of human cytomegalovirus protease. J Med Chem41:2882-91 (1998) 
 
Genome polyprotein
Name:Genome polyprotein
Type:PROTEIN
Mol. Mass.:44361.04
Organism:Human rhinovirus B
Description:ChEMBL_158953
Residue:401
BDBM50065886
NameBDBM50065886
Synonyms:(S)-2-Benzyl-4-oxo-azetidine-1-carboxylic acid (4-methoxy-phenyl)-amide | CHEMBL97195
TypeSmall organic molecule
Emp. Form.C18H18N2O3
Mol. Mass.310.3471
SMILESCOc1ccc(NC(=O)N2[C@@H](Cc3ccccc3)CC2=O)cc1