Reaction Details
TargetGenome polyprotein
LigandBDBM50065905
Substrate/Competitorn/a
Meas. Tech.ChEMBL_158967 (CHEMBL766325)
IC50 2600±n/a nM
Citation Yoakim, COgilvie, WWCameron, DRChabot, CGuse, IHaché, BNaud, JO'Meara, JAPlante, RDéziel, R beta-Lactam derivatives as inhibitors of human cytomegalovirus protease. J Med Chem41:2882-91 (1998) 
 
Genome polyprotein
Name:Genome polyprotein
Type:PROTEIN
Mol. Mass.:44361.04
Organism:Human rhinovirus B
Description:ChEMBL_158953
Residue:401
BDBM50065905
NameBDBM50065905
Synonyms:(S)-2-Benzyl-4-oxo-azetidine-1-carboxylic acid ((R)-1-phenyl-propyl)-amide | CHEMBL95575
TypeSmall organic molecule
Emp. Form.C20H22N2O2
Mol. Mass.322.4009
SMILESCC[C@@H](NC(=O)N1[C@@H](Cc2ccccc2)CC1=O)c1ccccc1