Reaction Details
TargetNeutrophil elastase
LigandBDBM50065883
Substrate/Competitorn/a
Meas. Tech.ChEMBL_63639 (CHEMBL675350)
IC50 3000±n/a nM
Citation Yoakim, COgilvie, WWCameron, DRChabot, CGuse, IHaché, BNaud, JO'Meara, JAPlante, RDéziel, R beta-Lactam derivatives as inhibitors of human cytomegalovirus protease. J Med Chem41:2882-91 (1998) 
 
Neutrophil elastase
Name:Neutrophil elastase
Type:Enzyme
Mol. Mass.:28532.38
Organism:Homo sapiens (Human)
Description:P08246
Residue:267
BDBM50065883
NameBDBM50065883
Synonyms:(S)-2-Benzyl-3,3-dimethyl-4-oxo-azetidine-1-carboxylic acid (pyridin-4-ylmethyl)-amide | CHEMBL99558
TypeSmall organic molecule
Emp. Form.C19H21N3O2
Mol. Mass.323.3889
SMILESCC1(C)[C@H](Cc2ccccc2)N(C(=O)NCc2ccncc2)C1=O